Target
Sphingosine kinase 2
Ligand
BDBM50426176
Substrate
Meas. Tech.
ChEMBL_935829 (CHEMBL2317615)
IC50
>1000±n/a nM
Citation
 Nacht, MQiao, LSheets, MPSt Martin, TLabenski, MMazdiyasni, HKarp, RZhu, ZChaturvedi, PBhavsar, DNiu, DWestlin, WPetter, RCMedikonda, APSingh, J Discovery of a potent and isoform-selective targeted covalent inhibitor of the lipid kinase PI3Ka. J Med Chem 56:712-21 (2013)  
Target
Name:
Sphingosine kinase 2
Synonyms:
SK 2 SPHK2 SPK 2 Sphingosine kinase types 2 (SphK2)
Type:
Protein
Mol. Mass.:
69221.44
Organism:
Homo sapiens (Human)
Description:
Q9NRA0
Residue:
654
  
Inhibitor
Name:
BDBM50426176
Synonyms:
CHEMBL2316958
Type:
Small organic molecule
Emp. Form.:
C30H35N7O3S
Mol. Mass.:
573.709
SMILES:
CC(C)=CC(=O)CCC(=O)N1CCN(Cc2cc3nc(nc(N4CCOCC4)c3s2)-c2cccc3[nH]ncc23)CC1
: