Target
Glutamate receptor ionotropic, kainate 2
Ligand
BDBM17657
Substrate
Meas. Tech.
ChEMBL_936439 (CHEMBL2317648)
Ki
331±n/a nM
Citation
 Assaf, ZLarsen, APVenskutonyte, RHan, LAbrahamsen, BNielsen, BGajhede, MKastrup, JSJensen, AAPickering, DSFrydenvang, KGefflaut, TBunch, L Chemoenzymatic synthesis of new 2,4-syn-functionalized (S)-glutamate analogues and structure-activity relationship studies at ionotropic glutamate receptors and excitatory amino acid transporters. J Med Chem 56:1614-28 (2013)  
Target
Name:
Glutamate receptor ionotropic, kainate 2
Synonyms:
GRIK2_RAT Glutamate receptor ionotropic kainate 2 Ionotropic glutamate receptor kainate 2/5
Type:
PROTEIN
Mol. Mass.:
102478.61
Organism:
Rattus norvegicus
Description:
ChEMBL_936439
Residue:
908
  
Inhibitor
Name:
BDBM17657
Synonyms:
(2S)-2-aminopentanedioic acid D-Glutamate L-Glu L-Glutamic acid L-gluatmate
Type:
Amino Acid
Emp. Form.:
C5H9NO4
Mol. Mass.:
147.1293
SMILES:
N[C@@H](CCC(O)=O)C(O)=O
: