Target
Excitatory amino acid transporter 1
Ligand
BDBM50426294
Substrate
Meas. Tech.
ChEMBL_936437 (CHEMBL2317646)
IC50
>300000±n/a nM
Citation
 Assaf, ZLarsen, APVenskutonyte, RHan, LAbrahamsen, BNielsen, BGajhede, MKastrup, JSJensen, AAPickering, DSFrydenvang, KGefflaut, TBunch, L Chemoenzymatic synthesis of new 2,4-syn-functionalized (S)-glutamate analogues and structure-activity relationship studies at ionotropic glutamate receptors and excitatory amino acid transporters. J Med Chem 56:1614-28 (2013)  
Target
Name:
Excitatory amino acid transporter 1
Synonyms:
EAA1_HUMAN Excitatory Amino Acid EAAT1 GLAST1 | SLC1A3
Type:
Enzyme Catalytic Domain
Mol. Mass.:
59577.19
Organism:
Homo sapiens (Human)
Description:
Excitatory Amino Acid EAAT1 0 HUMAN::P43003
Residue:
542
  
Inhibitor
Name:
BDBM50426294
Synonyms:
CHEMBL2312399
Type:
Small organic molecule
Emp. Form.:
C12H22N2O5
Mol. Mass.:
274.3135
SMILES:
CCN(CC)C(=O)CC[C@H](C[C@H](N)C(O)=O)C(O)=O
: