Target
Glutamate receptor ionotropic, kainate 3
Ligand
BDBM50426286
Substrate
Meas. Tech.
ChEMBL_936438 (CHEMBL2317647)
Ki
2500±n/a nM
Citation
 Assaf, ZLarsen, APVenskutonyte, RHan, LAbrahamsen, BNielsen, BGajhede, MKastrup, JSJensen, AAPickering, DSFrydenvang, KGefflaut, TBunch, L Chemoenzymatic synthesis of new 2,4-syn-functionalized (S)-glutamate analogues and structure-activity relationship studies at ionotropic glutamate receptors and excitatory amino acid transporters. J Med Chem 56:1614-28 (2013)  
Target
Name:
Glutamate receptor ionotropic, kainate 3
Synonyms:
GRIK3_RAT Glutamate receptor ionotropic kainate 3 Grik3
Type:
PROTEIN
Mol. Mass.:
104080.46
Organism:
Rattus norvegicus
Description:
ChEMBL_1447329
Residue:
919
  
Inhibitor
Name:
BDBM50426286
Synonyms:
CHEMBL2312686
Type:
Small organic molecule
Emp. Form.:
C8H13NO4
Mol. Mass.:
187.1931
SMILES:
OC(=O)[C@@H]1CCCN[C@@H](C1)C(O)=O
: