Target
Glutamate receptor ionotropic, kainate 3
Ligand
BDBM50426288
Substrate
Meas. Tech.
ChEMBL_936438 (CHEMBL2317647)
Ki
340±n/a nM
Citation
 Assaf, ZLarsen, APVenskutonyte, RHan, LAbrahamsen, BNielsen, BGajhede, MKastrup, JSJensen, AAPickering, DSFrydenvang, KGefflaut, TBunch, L Chemoenzymatic synthesis of new 2,4-syn-functionalized (S)-glutamate analogues and structure-activity relationship studies at ionotropic glutamate receptors and excitatory amino acid transporters. J Med Chem 56:1614-28 (2013)  
Target
Name:
Glutamate receptor ionotropic, kainate 3
Synonyms:
GRIK3_RAT Glutamate receptor ionotropic kainate 3 Grik3
Type:
PROTEIN
Mol. Mass.:
104080.46
Organism:
Rattus norvegicus
Description:
ChEMBL_1447329
Residue:
919
  
Inhibitor
Name:
BDBM50426288
Synonyms:
CHEMBL2312684
Type:
Small organic molecule
Emp. Form.:
C7H14N2O4
Mol. Mass.:
190.1971
SMILES:
NCC[C@H](C[C@H](N)C(O)=O)C(O)=O
: