Target
Glutamate receptor ionotropic, kainate 2
Ligand
BDBM50426299
Substrate
Meas. Tech.
ChEMBL_936439 (CHEMBL2317648)
Ki
>100000±n/a nM
Citation
 Assaf, ZLarsen, APVenskutonyte, RHan, LAbrahamsen, BNielsen, BGajhede, MKastrup, JSJensen, AAPickering, DSFrydenvang, KGefflaut, TBunch, L Chemoenzymatic synthesis of new 2,4-syn-functionalized (S)-glutamate analogues and structure-activity relationship studies at ionotropic glutamate receptors and excitatory amino acid transporters. J Med Chem 56:1614-28 (2013)  
Target
Name:
Glutamate receptor ionotropic, kainate 2
Synonyms:
GRIK2_RAT Glutamate receptor ionotropic kainate 2 Ionotropic glutamate receptor kainate 2/5
Type:
PROTEIN
Mol. Mass.:
102478.61
Organism:
Rattus norvegicus
Description:
ChEMBL_936439
Residue:
908
  
Inhibitor
Name:
BDBM50426299
Synonyms:
CHEMBL2312398
Type:
Small organic molecule
Emp. Form.:
C10H18N2O5
Mol. Mass.:
246.2603
SMILES:
CN(C)C(=O)CC[C@H](C[C@H](N)C(O)=O)C(O)=O
: