Target
Casein kinase I isoform alpha
Ligand
BDBM7401
Substrate
Meas. Tech.
ChEMBL_939731 (CHEMBL2329084)
IC50
1200±n/a nM
Citation
 Myrianthopoulos, VKritsanida, MGaboriaud-Kolar, NMagiatis, PFerandin, YDurieu, ELozach, OCappel, DSoundararajan, MFilippakopoulos, PSherman, WKnapp, SMeijer, LMikros, ESkaltsounis, AL Novel Inverse Binding Mode of Indirubin Derivatives Yields Improved Selectivity for DYRK Kinases. ACS Med Chem Lett 4:22-26 (2013)  
Target
Name:
Casein kinase I isoform alpha
Synonyms:
CK1 CSNK1A1 | KC1A_PIG
Type:
PROTEIN
Mol. Mass.:
14639.55
Organism:
Sus scrofa
Description:
ChEMBL_939731
Residue:
125
  
Inhibitor
Name:
BDBM7401
Synonyms:
(2 Z,3 E)-6-Bromoindirubin-3 -oxime 6-bromo-3-[(2Z,3E)-3-(hydroxyimino)-2,3-dihydro-1H-indol-2-ylidene]-2,3-dihydro-1H-indol-2-one 6BIO indirubin deriv. 7a
Type:
Small organic molecule
Emp. Form.:
C16H10BrN3O2
Mol. Mass.:
356.174
SMILES:
Brc1ccc2C(C(=O)Nc2c1)c1[nH]c2ccccc2c1N=O
: