Target
Apoptosis regulator Bcl-2
Ligand
BDBM21447
Substrate
Meas. Tech.
ChEMBL_940158 (CHEMBL2328333)
Kd
0.600000±n/a nM
Citation
 Touré, BBMiller-Moslin, KYusuff, NPerez, LDoré, MJoud, CMichael, WDiPietro, Lvan der Plas, SMcEwan, MLenoir, FHoe, MKarki, RSpringer, CSullivan, JLevine, KFiorilla, CXie, XKulathila, RHerlihy, KPorter, DVisser, M The role of the acidity of N-heteroaryl sulfonamides as inhibitors of bcl-2 family protein-protein interactions. ACS Med Chem Lett 4:186-90 (2013)  
Target
Name:
Apoptosis regulator Bcl-2
Synonyms:
Apoptosis regulator Bcl-2 Protein BCL-2 BCL2_HUMAN | Bcl-2 Protein
Type:
Homodimer or heterodimer
Mol. Mass.:
26269.11
Organism:
Homo sapiens (Human)
Description:
P10415
Residue:
239
  
Inhibitor
Name:
BDBM21447
Synonyms:
4-(4-{[2-(4-chlorophenyl)phenyl]methyl}piperazin-1-yl)-N-[(4-{[(2R)-4-(dimethylamino)-1-(phenylsulfanyl)butan-2-yl]amino}-3-nitrobenzene)sulfonyl]benzamide CHEMBL376408 US11760752, Compound ABT-737 | US9125913, ABT-737
Type:
Small organic molecule
Emp. Form.:
C42H45ClN6O5S2
Mol. Mass.:
813.427
SMILES:
CN(C)CC[C@H](CSc1ccccc1)Nc1ccc(cc1[N+]([O-])=O)S(=O)(=O)NC(=O)c1ccc(cc1)N1CCN(Cc2ccccc2-c2ccc(Cl)cc2)CC1
: