Target
Cell division cycle 7-related protein kinase
Ligand
BDBM50426461
Substrate
Meas. Tech.
ChEMBL_940355 (CHEMBL2328973)
Ki
0.900000±n/a nM
Citation
 Tong, YStewart, KDFlorjancic, ASHarlan, JEMerta, PJPrzytulinska, MSoni, NSwinger, KKZhu, HJohnson, EFShoemaker, ARPenning, TD Azaindole-Based Inhibitors of Cdc7 Kinase: Impact of the Pre-DFG Residue, Val 195. ACS Med Chem Lett 4:211-5 (2013)  
Target
Name:
Cell division cycle 7-related protein kinase
Synonyms:
CDC7 CDC7L1 Cell division cycle 7-related protein kinase (CDC7) huCdc7
Type:
Protein
Mol. Mass.:
63908.16
Organism:
Homo sapiens (Human)
Description:
O00311
Residue:
574
  
Inhibitor
Name:
BDBM50426461
Synonyms:
CHEMBL2322677
Type:
Small organic molecule
Emp. Form.:
C18H19ClN4
Mol. Mass.:
326.823
SMILES:
Clc1cc(cc(NC2CCCCC2)n1)-c1c[nH]c2ncccc12
: