Target
Fibroblast growth factor receptor 1
Ligand
BDBM50426474
Substrate
Meas. Tech.
ChEMBL_940533 (CHEMBL2327151)
IC50
28±n/a nM
Citation
 Liu, JJHiggins, BJu, GKolinsky, KLuk, KCPackman, KPizzolato, GRen, YThakkar, KTovar, CZhang, ZWovkulich, PM Discovery of a highly potent, orally active mitosis/angiogenesis inhibitor r1530 for the treatment of solid tumors. ACS Med Chem Lett 4:259-63 (2013)  
Target
Name:
Fibroblast growth factor receptor 1
Synonyms:
BFGFR Basic fibroblast growth factor receptor 1 (FGFR1) CEK FGFR-1 FGFR-1, (FL) FGFR1_HUMAN FLT2 Fibroblast growth factor receptor 1 (FGFR-1) Fms-like tyrosine kinase 2 N-sam bFGF-R | c-fgr
Type:
Receptor
Mol. Mass.:
91861.70
Organism:
Homo sapiens (Human)
Description:
P11362
Residue:
822
  
Inhibitor
Name:
BDBM50426474
Synonyms:
CHEMBL1980391
Type:
Small organic molecule
Emp. Form.:
C18H14ClFN4O
Mol. Mass.:
356.781
SMILES:
COc1cc2Nc3[nH]nc(C)c3N=C(c3ccccc3Cl)c2cc1F
: