Target
5-hydroxytryptamine receptor 2B
Ligand
BDBM50070181
Substrate
Meas. Tech.
ChEMBL_938245 (CHEMBL2328668)
EC50
16±n/a nM
Citation
 Dosa, PIWard, TWalters, MAKim, SW Synthesis of novel analogs of cabergoline: improving cardiovascular safety by removing 5-HT2B receptor agonism. ACS Med Chem Lett 4:254-258 (2013)  
Target
Name:
5-hydroxytryptamine receptor 2B
Synonyms:
5-HT-2B 5-hydroxytryptamine (serotonin) receptor 2B [Homo sapiens] 5-hydroxytryptamine receptor 2C (5HT2C) HTR2B Serotonin 2b (5-HT2b) receptor | Serotonin Receptor 2B
Type:
G Protein-Coupled Receptor (GPCR)
Mol. Mass.:
54312.47
Organism:
Homo sapiens (Human)
Description:
Receptor binding assays were performed using human clone stably expressed in CHO cells.
Residue:
481
  
Inhibitor
Name:
BDBM50070181
Synonyms:
1-(3-Dimethylamino-propyl)-3-ethyl-1-((6aR,9R,10aR)-7-methyl-4,6,6a,7,8,9,10,10a-octahydro-indolo[4,3-fg]quinoline-9-carbonyl)-urea | CHEMBL14022
Type:
Small organic molecule
Emp. Form.:
C24H35N5O2
Mol. Mass.:
425.567
SMILES:
CCNC(=O)N(CCCN(C)C)C(=O)[C@@H]1C[C@H]2[C@@H](Cc3c[nH]c4cccc2c34)N(C)C1
: