Target
Acetyl-CoA carboxylase 1
Ligand
BDBM50426521
Substrate
Meas. Tech.
ChEMBL_938403 (CHEMBL2329346)
IC50
2.2±n/a nM
Citation
 Abdel-Magid, AF Treatment of Obesity and Related Disorders with Acetyl-CoA Carboxylase Inhibitors. ACS Med Chem Lett 4:16-7 (2013)  
Target
Name:
Acetyl-CoA carboxylase 1
Synonyms:
ACAC ACACA_HUMAN ACC1 Acetyl-CoA carboxylase 1 | Acetyl-CoA carboxylase 1 (ACC1)
Type:
Protein
Mol. Mass.:
265543.22
Organism:
Homo sapiens (Human)
Description:
Q13085
Residue:
2346
  
Inhibitor
Name:
BDBM50426521
Synonyms:
CHEMBL2323626
Type:
Small organic molecule
Emp. Form.:
C26H31N5O2
Mol. Mass.:
445.5566
SMILES:
CNc1ccc2ccc(cc2n1)C(=O)N1CCC2(CC1)Cc1cn(nc1C(=O)C2)C(C)(C)C
: