Target
Transient receptor potential cation channel subfamily M member 8
Ligand
BDBM50331290
Substrate
Meas. Tech.
ChEMBL_938819 (CHEMBL2327963)
IC50
4.0±n/a nM
Citation
 Bagal, SKBrown, ADCox, PJOmoto, KOwen, RMPryde, DCSidders, BSkerratt, SEStevens, EBStorer, RISwain, NA Ion channels as therapeutic targets: a drug discovery perspective. J Med Chem 56:593-624 (2013)  
Target
Name:
Transient receptor potential cation channel subfamily M member 8
Synonyms:
LTRPC6 TRPM8_HUMAN Transient receptor potential M8 protein (TRPM8) Transient receptor potential cation channel subfamily M member 8 (TRPM8)
Type:
Enzyme
Mol. Mass.:
127693.26
Organism:
Homo sapiens (Human)
Description:
Q7Z2W7
Residue:
1104
  
Inhibitor
Name:
BDBM50331290
Synonyms:
CHEMBL1289953 | N-(3-aminopropyl)-2-(3-methylbenzyloxy)-N-(thiophen-2-ylmethyl)benzamide
Type:
Small organic molecule
Emp. Form.:
C23H26N2O2S
Mol. Mass.:
394.53
SMILES:
Cc1cccc(COc2ccccc2C(=O)N(CCCN)Cc2cccs2)c1
: