Target
Tyrosine-protein kinase JAK2
Ligand
BDBM50426602
Substrate
Meas. Tech.
ChEMBL_939090 (CHEMBL2329053)
IC50
8900±n/a nM
Citation
 Soth, MHermann, JCYee, CAlam, MBarnett, JWBerry, PBrowner, MFFrank, KFrauchiger, SHarris, SHe, YHekmat-Nejad, MHendricks, THenningsen, RHilgenkamp, RHo, HHoffman, AHsu, PYHu, DQItano, AJaime-Figueroa, SJahangir, AJin, SKuglstatter, AKutach, AKLiao, CLynch, SMenke, JNiu, LPatel, VRailkar, ARoy, DShao, AShaw, DSteiner, SSun, YTan, SLWang, SVu, MD 3-Amido pyrrolopyrazine JAK kinase inhibitors: development of a JAK3 vs JAK1 selective inhibitor and evaluation in cellular and in vivo models. J Med Chem 56:345-56 (2013)  
Target
Name:
Tyrosine-protein kinase JAK2
Synonyms:
JAK-2 JAK2_HUMAN Janus kinase 2 (JAK2) | Janus kinase 2 (a protein tyrosine kinase)
Type:
Protein
Mol. Mass.:
130684.68
Organism:
Homo sapiens (Human)
Description:
O60674
Residue:
1132
  
Inhibitor
Name:
BDBM50426602
Synonyms:
CHEMBL2325894
Type:
Small organic molecule
Emp. Form.:
C17H18N6O2
Mol. Mass.:
338.3638
SMILES:
C[C@@H](NC(=O)c1c[nH]c2ncc(nc12)C1CC1)C(=O)N1CC(C1)C#N
: