Target
Tyrosine-protein kinase JAK1
Ligand
BDBM50426610
Substrate
Meas. Tech.
ChEMBL_939262 (CHEMBL2329569)
IC50
431±n/a nM
Citation
 Soth, MHermann, JCYee, CAlam, MBarnett, JWBerry, PBrowner, MFFrank, KFrauchiger, SHarris, SHe, YHekmat-Nejad, MHendricks, THenningsen, RHilgenkamp, RHo, HHoffman, AHsu, PYHu, DQItano, AJaime-Figueroa, SJahangir, AJin, SKuglstatter, AKutach, AKLiao, CLynch, SMenke, JNiu, LPatel, VRailkar, ARoy, DShao, AShaw, DSteiner, SSun, YTan, SLWang, SVu, MD 3-Amido pyrrolopyrazine JAK kinase inhibitors: development of a JAK3 vs JAK1 selective inhibitor and evaluation in cellular and in vivo models. J Med Chem 56:345-56 (2013)  
Target
Name:
Tyrosine-protein kinase JAK1
Synonyms:
JAK-1 JAK1A JAK1_HUMAN Janus kinase 1 (JAK1) | Janus kinase 1 JAK1
Type:
Protein
Mol. Mass.:
133293.73
Organism:
Homo sapiens (Human)
Description:
P23458
Residue:
1154
  
Inhibitor
Name:
BDBM50426610
Synonyms:
CHEMBL2325910
Type:
Small organic molecule
Emp. Form.:
C17H21N5O2
Mol. Mass.:
327.3809
SMILES:
C[C@@H](NC(=O)c1c[nH]c2ncc(nc12)C1CC1)C(=O)N1CCCC1
: