Target
Tyrosine-protein kinase JAK2
Ligand
BDBM50193995
Substrate
Meas. Tech.
ChEMBL_939263 (CHEMBL2329570)
IC50
4.0±n/a nM
Citation
 Soth, MHermann, JCYee, CAlam, MBarnett, JWBerry, PBrowner, MFFrank, KFrauchiger, SHarris, SHe, YHekmat-Nejad, MHendricks, THenningsen, RHilgenkamp, RHo, HHoffman, AHsu, PYHu, DQItano, AJaime-Figueroa, SJahangir, AJin, SKuglstatter, AKutach, AKLiao, CLynch, SMenke, JNiu, LPatel, VRailkar, ARoy, DShao, AShaw, DSteiner, SSun, YTan, SLWang, SVu, MD 3-Amido pyrrolopyrazine JAK kinase inhibitors: development of a JAK3 vs JAK1 selective inhibitor and evaluation in cellular and in vivo models. J Med Chem 56:345-56 (2013)  
Target
Name:
Tyrosine-protein kinase JAK2
Synonyms:
JAK-2 JAK2_HUMAN Janus kinase 2 (JAK2) | Janus kinase 2 (a protein tyrosine kinase)
Type:
Protein
Mol. Mass.:
130684.68
Organism:
Homo sapiens (Human)
Description:
O60674
Residue:
1132
  
Inhibitor
Name:
BDBM50193995
Synonyms:
3-((3R,4R)-4-methyl-3-(methyl(7H-pyrrolo[2,3-d]pyrimidin-4-yl)amino)piperidin-1-yl)-3-oxopropanenitrile 3-{(3R,4R)-4-methyl-3-[methyl(7H-pyrrolo[2,3-d]pyrimidin-4-yl)amino]piperidin-1-yl}-3-oxopropanenitrile CP-690550 Tofacitinib US10112907, Example 00035 US10766894, Compound TABLE 1.20 US11078206, Example Tofacitinib US11339167, Example Tofacitinib
Type:
Small organic molecule
Emp. Form.:
C16H20N6O
Mol. Mass.:
312.3696
SMILES:
C[C@@H]1CCN(C[C@@H]1N(C)c1ncnc2[nH]ccc12)C(=O)CC#N
: