Target
Serine-protein kinase ATM
Ligand
BDBM50427326
Substrate
Meas. Tech.
ChEMBL_940917 (CHEMBL2330563)
IC50
>30000±n/a nM
Citation
 Foote, KMBlades, KCronin, AFillery, SGuichard, SSHassall, LHickson, IJacq, XJewsbury, PJMcGuire, TMNissink, JWOdedra, RPage, KPerkins, PSuleman, ATam, KThommes, PBroadhurst, RWood, C Discovery of 4-{4-[(3R)-3-Methylmorpholin-4-yl]-6-[1-(methylsulfonyl)cyclopropyl]pyrimidin-2-yl}-1H-indole (AZ20): a potent and selective inhibitor of ATR protein kinase with monotherapy in vivo antitumor activity. J Med Chem 56:2125-38 (2013)  
Target
Name:
Serine-protein kinase ATM
Synonyms:
A-T mutated ATM_HUMAN | Ataxia telangiectasia mutated
Type:
Protein
Mol. Mass.:
350696.72
Organism:
Homo sapiens (Human)
Description:
Q13315
Residue:
3056
  
Inhibitor
Name:
BDBM50427326
Synonyms:
CHEMBL2325697
Type:
Small organic molecule
Emp. Form.:
C21H24N4O3S
Mol. Mass.:
412.505
SMILES:
C[C@@H]1COCCN1c1cc(nc(n1)-c1cccc2[nH]ccc12)C1(CC1)S(C)(=O)=O
: