Target
Rho-associated protein kinase 2
Ligand
BDBM50427336
Substrate
Meas. Tech.
ChEMBL_941085 (CHEMBL2330882)
IC50
31±n/a nM
Citation
 Addie, MBallard, PButtar, DCrafter, CCurrie, GDavies, BRDebreczeni, JDry, HDudley, PGreenwood, RJohnson, PDKettle, JGLane, CLamont, GLeach, ALuke, RWMorris, JOgilvie, DPage, KPass, MPearson, SRuston, L Discovery of 4-amino-N-[(1S)-1-(4-chlorophenyl)-3-hydroxypropyl]-1-(7H-pyrrolo[2,3-d]pyrimidin-4-yl)piperidine-4-carboxamide (AZD5363), an orally bioavailable, potent inhibitor of Akt kinases. J Med Chem 56:2059-73 (2013)  
Target
Name:
Rho-associated protein kinase 2
Synonyms:
KIAA0619 ROCK2 Rho kinase 2 (ROCKII) Rho-associated protein kinase 2 (ROCK2) Rho-associated protein kinase 2/Transforming protein RhoA Rho-associated, coiled-coil-containing protein kinase II p164 ROCK-2
Type:
Protein
Mol. Mass.:
160885.43
Organism:
Homo sapiens (Human)
Description:
O75116
Residue:
1388
  
Inhibitor
Name:
BDBM50427336
Synonyms:
CHEMBL2325992 US11236095, Example 11 | US9492453, 11
Type:
Small organic molecule
Emp. Form.:
C23H30ClN7O
Mol. Mass.:
455.984
SMILES:
CN(C)CCC(NC(=O)C1(N)CCN(CC1)c1ncnc2[nH]ccc12)c1ccc(Cl)cc1
: