Target
RAC-beta serine/threonine-protein kinase
Ligand
BDBM50427360
Substrate
Meas. Tech.
ChEMBL_941088 (CHEMBL2330885)
IC50
13±n/a nM
Citation
 Addie, MBallard, PButtar, DCrafter, CCurrie, GDavies, BRDebreczeni, JDry, HDudley, PGreenwood, RJohnson, PDKettle, JGLane, CLamont, GLeach, ALuke, RWMorris, JOgilvie, DPage, KPass, MPearson, SRuston, L Discovery of 4-amino-N-[(1S)-1-(4-chlorophenyl)-3-hydroxypropyl]-1-(7H-pyrrolo[2,3-d]pyrimidin-4-yl)piperidine-4-carboxamide (AZD5363), an orally bioavailable, potent inhibitor of Akt kinases. J Med Chem 56:2059-73 (2013)  
Target
Name:
RAC-beta serine/threonine-protein kinase
Synonyms:
AKT2 PKB beta Protein kinase B (Akt 2) Protein kinase B, beta RAC-alpha serine/threonine-protein kinase (AKT2) RAC-beta serine/threonine-protein kinase (AKT2) Serine/threonine-protein kinase AKT2 | Serine/threonine-protein kinase Rac alpha/beta
Type:
Enzyme
Mol. Mass.:
55766.64
Organism:
Homo sapiens (Human)
Description:
Residue:
481
  
Inhibitor
Name:
BDBM50427360
Synonyms:
CHEMBL2325729 US11236095, Example 52 | US9492453, 52
Type:
Small organic molecule
Emp. Form.:
C26H34ClN7O
Mol. Mass.:
496.047
SMILES:
NC1(CCN(CC1)c1ncnc2[nH]ccc12)C(=O)N[C@@H](CCN1CCCCC1)c1ccc(Cl)cc1
: