Target
Protein kinase C zeta type
Ligand
BDBM50427363
Substrate
Meas. Tech.
ChEMBL_941098 (CHEMBL2330895)
Ki
>5000±n/a nM
Citation
 Jimenez, JMBoyall, DBrenchley, GCollier, PNDavis, CJFraysse, DKeily, SBHenderson, JMiller, APierard, FSettimo, LTwin, HCBolton, CMCurnock, APChiu, PTanner, AJYoung, S Design and optimization of selective protein kinase C¿ (PKC¿) inhibitors for the treatment of autoimmune diseases. J Med Chem 56:1799-810 (2013)  
Target
Name:
Protein kinase C zeta type
Synonyms:
KPCZ_HUMAN PRKCZ Protein kinase C (PKC) Protein kinase C zeta Protein kinase C zeta type Protein kinase C zeta type (PKCzeta) | nPKC-zeta
Type:
Enzyme
Mol. Mass.:
67649.13
Organism:
Homo sapiens (Human)
Description:
Residue:
592
  
Inhibitor
Name:
BDBM50427363
Synonyms:
CHEMBL2326002
Type:
Small organic molecule
Emp. Form.:
C20H24ClFN6O
Mol. Mass.:
418.896
SMILES:
CC(C)[C@@](C)(O)[C@@H]1CN(CCN1)c1nc(-c2n[nH]c3ncccc23)c(F)cc1Cl
: