Target
Protein kinase C theta type
Ligand
BDBM50427375
Substrate
Meas. Tech.
ChEMBL_941193 (CHEMBL2329704)
Ki
133±n/a nM
Citation
 Jimenez, JMBoyall, DBrenchley, GCollier, PNDavis, CJFraysse, DKeily, SBHenderson, JMiller, APierard, FSettimo, LTwin, HCBolton, CMCurnock, APChiu, PTanner, AJYoung, S Design and optimization of selective protein kinase C¿ (PKC¿) inhibitors for the treatment of autoimmune diseases. J Med Chem 56:1799-810 (2013)  
Target
Name:
Protein kinase C theta type
Synonyms:
KPCT_HUMAN PRKCT Protein kinase C theta type (PRKCQ) nPKC-theta
Type:
Serine/threonine-protein kinase
Mol. Mass.:
81878.04
Organism:
Homo sapiens (Human)
Description:
Full-length human PKC theta (Panvera Catalog No. P2996).
Residue:
706
  
Inhibitor
Name:
BDBM50427375
Synonyms:
CHEMBL2326008
Type:
Small organic molecule
Emp. Form.:
C20H25FN6O
Mol. Mass.:
384.4505
SMILES:
CC(C)[C@](C)(O)[C@H]1CN(CCN1)c1ccc(F)c(n1)-c1n[nH]c2ncccc12
: