Target
Nuclear factor NF-kappa-B p105 subunit
Ligand
BDBM50427509
Substrate
Meas. Tech.
ChEMBL_941587 (CHEMBL2330627)
EC50
600000±n/a nM
Citation
 Marzaro, GGuiotto, ABorgatti, MFinotti, AGambari, RBreveglieri, GChilin, A Psoralen derivatives as inhibitors of NF-¿B/DNA interaction: synthesis, molecular modeling, 3D-QSAR, and biological evaluation. J Med Chem 56:1830-42 (2013)  
Target
Name:
Nuclear factor NF-kappa-B p105 subunit
Synonyms:
NFKB1 Nuclear factor NF-kappa-B (NF-kB) Nuclear factor NF-kappa-B p105 subunit
Type:
Protein
Mol. Mass.:
105329.57
Organism:
Homo sapiens (Human)
Description:
P19838
Residue:
968
  
Inhibitor
Name:
BDBM50427509
Synonyms:
CHEMBL1829845
Type:
Small organic molecule
Emp. Form.:
C27H27NO6
Mol. Mass.:
461.5064
SMILES:
Cc1c(CC(=O)NC(Cc2ccccc2)C(O)=O)c(=O)oc2cc3occ(c3cc12)C(C)(C)C
: