Target
Delta-type opioid receptor
Ligand
BDBM50427559
Substrate
Meas. Tech.
ChEMBL_941602 (CHEMBL2330684)
Ki
10.0±n/a nM
Citation
 Mosberg, HIYeomans, LHarland, AABender, AMSobczyk-Kojiro, KAnand, JPClark, MJJutkiewicz, EMTraynor, JR Opioid peptidomimetics: leads for the design of bioavailable mixed efficacyµ opioid receptor (MOR) agonist/d opioid receptor (DOR) antagonist ligands. J Med Chem 56:2139-49 (2013)  
Target
Name:
Delta-type opioid receptor
Synonyms:
Cytochrome P450 3A4 Delta opioid receptor Delta-type opioid receptor (DOR) OPRD_RAT Opioid receptor Opioid receptors; mu & delta Ror-a | Voltage-gated potassium channel
Type:
G Protein-Coupled Receptor (GPCR)
Mol. Mass.:
40465.04
Organism:
Rattus norvegicus (rat)
Description:
Competition binding assays were using CHO-K1 cell membranes expressing the opioid receptor.
Residue:
372
  
Inhibitor
Name:
BDBM50427559
Synonyms:
CHEMBL2322562
Type:
Small organic molecule
Emp. Form.:
C31H33N3O2
Mol. Mass.:
479.6126
SMILES:
Cc1cc(O)cc(C)c1C[C@H](N)C(=O)N[C@@H]1CCNc2ccc(Cc3ccc4ccccc4c3)cc12
: