Target
Kappa-type opioid receptor
Ligand
BDBM50427562
Substrate
Meas. Tech.
ChEMBL_941600 (CHEMBL2330682)
Ki
130±n/a nM
Citation
 Mosberg, HIYeomans, LHarland, AABender, AMSobczyk-Kojiro, KAnand, JPClark, MJJutkiewicz, EMTraynor, JR Opioid peptidomimetics: leads for the design of bioavailable mixed efficacyµ opioid receptor (MOR) agonist/d opioid receptor (DOR) antagonist ligands. J Med Chem 56:2139-49 (2013)  
Target
Name:
Kappa-type opioid receptor
Synonyms:
K-OR-1 Kappa-opioid receptor (KOR) Kappa-type opioid receptor (KOR) OPIATE Kappa OPRK1 kappa opioid receptor (KOR)
Type:
G Protein-Coupled Receptor (GPCR)
Mol. Mass.:
42648.76
Organism:
Homo sapiens (Human)
Description:
P41145
Residue:
380
  
Inhibitor
Name:
BDBM50427562
Synonyms:
CHEMBL2322566
Type:
Small organic molecule
Emp. Form.:
C31H33N3O2
Mol. Mass.:
479.6126
SMILES:
Cc1cc(O)cc(C)c1C[C@H](N)C(=O)N[C@H]1CCNc2ccc(Cc3ccc4ccccc4c3)cc12
: