Target
Mu-type opioid receptor
Ligand
BDBM50427559
Substrate
Meas. Tech.
ChEMBL_941601 (CHEMBL2330683)
Ki
0.078000±n/a nM
Citation
 Mosberg, HIYeomans, LHarland, AABender, AMSobczyk-Kojiro, KAnand, JPClark, MJJutkiewicz, EMTraynor, JR Opioid peptidomimetics: leads for the design of bioavailable mixed efficacyµ opioid receptor (MOR) agonist/d opioid receptor (DOR) antagonist ligands. J Med Chem 56:2139-49 (2013)  
Target
Name:
Mu-type opioid receptor
Synonyms:
MOR-1 Mu-type opioid receptor (MOR) OPRM_RAT Opioid receptor B Ror-b
Type:
G Protein-Coupled Receptor (GPCR)
Mol. Mass.:
44503.11
Organism:
Rattus norvegicus (rat)
Description:
Competition binding assays were carried out using membrane preparations from transfected HN9.10 cells that constitutively expressed the mu opioid receptor.
Residue:
398
  
Inhibitor
Name:
BDBM50427559
Synonyms:
CHEMBL2322562
Type:
Small organic molecule
Emp. Form.:
C31H33N3O2
Mol. Mass.:
479.6126
SMILES:
Cc1cc(O)cc(C)c1C[C@H](N)C(=O)N[C@@H]1CCNc2ccc(Cc3ccc4ccccc4c3)cc12
: