Target
Prostaglandin G/H synthase 1
Ligand
BDBM50427621
Substrate
Meas. Tech.
ChEMBL_941818 (CHEMBL2329809)
IC50
2190±n/a nM
Citation
 Liedtke, AJAdeniji, AOChen, MByrns, MCJin, YChristianson, DWMarnett, LJPenning, TM Development of potent and selective indomethacin analogues for the inhibition of AKR1C3 (Type 5 17ß-hydroxysteroid dehydrogenase/prostaglandin F synthase) in castrate-resistant prostate cancer. J Med Chem 56:2429-46 (2013)  
Target
Name:
Prostaglandin G/H synthase 1
Synonyms:
COX-1 Cyclooxygenase Cyclooxygenase-1 (COX-1) PTGS1 | Prostaglandin G/H synthase (cyclooxygenase)
Type:
Enzyme
Mol. Mass.:
68692.62
Organism:
Homo sapiens (Human)
Description:
P23219
Residue:
599
  
Inhibitor
Name:
BDBM50427621
Synonyms:
CHEMBL2323490 | US9346803, 1
Type:
Small organic molecule
Emp. Form.:
C19H14ClF3N2O5S
Mol. Mass.:
474.838
SMILES:
COc1ccc2n(cc(CC(=O)NS(=O)(=O)C(F)(F)F)c2c1)C(=O)c1ccc(Cl)cc1
: