Target
Aldo-keto reductase family 1 member C2
Ligand
BDBM50427655
Substrate
Meas. Tech.
ChEMBL_941825 (CHEMBL2329816)
IC50
100000±n/a nM
Citation
 Liedtke, AJAdeniji, AOChen, MByrns, MCJin, YChristianson, DWMarnett, LJPenning, TM Development of potent and selective indomethacin analogues for the inhibition of AKR1C3 (Type 5 17ß-hydroxysteroid dehydrogenase/prostaglandin F synthase) in castrate-resistant prostate cancer. J Med Chem 56:2429-46 (2013)  
Target
Name:
Aldo-keto reductase family 1 member C2
Synonyms:
3-alpha-HSD3 AK1C2_HUMAN Aldo-keto reductase family 1 member C2 (AK1C2) Aldo-keto reductase family 1 member C2 (AKR1C2) DD-2 DDH2 Dihydrodiol dehydrogenase/bile acid-binding protein Type III 3-alpha-hydroxysteroid dehydrogenase
Type:
Enzyme
Mol. Mass.:
36739.89
Organism:
Homo sapiens (Human)
Description:
Residue:
323
  
Inhibitor
Name:
BDBM50427655
Synonyms:
DESCHLOROBENZOYL INDOMETHACIN
Type:
Small organic molecule
Emp. Form.:
C12H13NO3
Mol. Mass.:
219.2365
SMILES:
COc1ccc2[nH]c(C)c(CC(O)=O)c2c1
: