Target
Aldo-keto reductase family 1 member C3
Ligand
BDBM50427640
Substrate
Meas. Tech.
ChEMBL_941824 (CHEMBL2329815)
IC50
6340±n/a nM
Citation
 Liedtke, AJAdeniji, AOChen, MByrns, MCJin, YChristianson, DWMarnett, LJPenning, TM Development of potent and selective indomethacin analogues for the inhibition of AKR1C3 (Type 5 17ß-hydroxysteroid dehydrogenase/prostaglandin F synthase) in castrate-resistant prostate cancer. J Med Chem 56:2429-46 (2013)  
Target
Name:
Aldo-keto reductase family 1 member C3
Synonyms:
17-beta-Hydroxysteroid Dehydrogenase 5 (17-beta-HSD5, AKR1C3) AK1C3_HUMAN Aldo-keto reductase family 1 member C3 Aldo-keto reductase family 1 member C3 (AK1C3a) Aldo-keto-reductase family 1 member C3 Dihydrodiol dehydrogenase 3 Estradiol 17-beta-dehydrogenase KIAA0119 Prostaglandin F synthase Trans-1,2-dihydrobenzene-1,2-diol dehydrogenase
Type:
Enzyme
Mol. Mass.:
36859.86
Organism:
Homo sapiens (Human)
Description:
P42330
Residue:
323
  
Inhibitor
Name:
BDBM50427640
Synonyms:
CHEMBL2323498
Type:
Small organic molecule
Emp. Form.:
C27H25ClN2O5S
Mol. Mass.:
525.016
SMILES:
COc1ccc2n(cc(CC(=O)NS(=O)(=O)c3ccc(cc3)C(C)C)c2c1)C(=O)c1ccc(Cl)cc1
: