Target
Tyrosine-protein kinase ABL2
Ligand
BDBM50427744
Substrate
Meas. Tech.
ChEMBL_941935 (CHEMBL2330092)
IC50
14±n/a nM
Citation
 Desai, BDixon, KFarrant, EFeng, QGibson, KRvan Hoorn, WPMills, JMorgan, TParry, DMRamjee, MKSelway, CNTarver, GJWhitlock, GWright, AG Rapid discovery of a novel series of Abl kinase inhibitors by application of an integrated microfluidic synthesis and screening platform. J Med Chem 56:3033-47 (2013)  
Target
Name:
Tyrosine-protein kinase ABL2
Synonyms:
ABL2 ABLL Abelson murine leukemia viral oncogene homolog 2 Tyrosine kinase ARG | VHL/Tyrosine-protein kinase ABL2
Type:
PROTEIN
Mol. Mass.:
128360.63
Organism:
Homo sapiens (Human)
Description:
ChEMBL_325082
Residue:
1182
  
Inhibitor
Name:
BDBM50427744
Synonyms:
CHEMBL2324928
Type:
Small organic molecule
Emp. Form.:
C25H26F3N7O
Mol. Mass.:
497.5154
SMILES:
CN1CCN(Cc2ccc(NC(=O)Nc3cc(C#Cc4cccnc4)n(C)n3)cc2C(F)(F)F)CC1
: