Target
Protein arginine N-methyltransferase 3 [N508S]
Ligand
BDBM50427782
Substrate
Meas. Tech.
ChEMBL_941988 (CHEMBL2330282)
IC50
>15000±n/a nM
Citation
 Liu, FLi, FMa, ADobrovetsky, EDong, AGao, CKorboukh, ILiu, JSmil, DBrown, PJFrye, SVArrowsmith, CHSchapira, MVedadi, MJin, J Exploiting an allosteric binding site of PRMT3 yields potent and selective inhibitors. J Med Chem 56:2110-24 (2013)  
Target
Name:
Protein arginine N-methyltransferase 3 [N508S]
Synonyms:
ANM3_HUMAN Heterogeneous nuclear ribonucleoprotein methyltransferase-like protein 3 Protein arginine N-methyltransferase 3 | Protein arginine N-methyltransferase 3 (PRMT3)
Type:
Protein
Mol. Mass.:
59859.85
Organism:
Homo sapiens (Human)
Description:
O60678[N508S]
Residue:
531
  
Inhibitor
Name:
BDBM50427782
Synonyms:
CHEMBL2325173
Type:
Small organic molecule
Emp. Form.:
C13H11N5OS
Mol. Mass.:
285.324
SMILES:
O=C(NCc1cccnc1)Nc1ccc2nnsc2c1
: