Target
Arginase-1
Ligand
BDBM50427901
Substrate
Meas. Tech.
ChEMBL_940977 (CHEMBL2330667)
IC50
8000±n/a nM
Citation
 Van Zandt, MCWhitehouse, DLGolebiowski, AJi, MKZhang, MBeckett, RPJagdmann, GERyder, TRSheeler, RAndreoli, MConway, BMahboubi, KD'Angelo, GMitschler, ACousido-Siah, ARuiz, FXHoward, EIPodjarny, ADSchroeter, H Discovery of (R)-2-amino-6-borono-2-(2-(piperidin-1-yl)ethyl)hexanoic acid and congeners as highly potent inhibitors of human arginases I and II for treatment of myocardial reperfusion injury. J Med Chem 56:2568-80 (2013)  
Target
Name:
Arginase-1
Synonyms:
ARG1 Liver-type arginase | Type I arginase
Type:
PROTEIN
Mol. Mass.:
34737.53
Organism:
Homo sapiens (Human)
Description:
ChEMBL_978893
Residue:
322
  
Inhibitor
Name:
BDBM50427901
Synonyms:
CHEMBL2326088
Type:
Small organic molecule
Emp. Form.:
C6H14BNO4
Mol. Mass.:
174.991
SMILES:
N[C@H](CCCCB(O)O)C(O)=O
: