Target
Potassium voltage-gated channel subfamily H member 2
Ligand
BDBM50427959
Substrate
Meas. Tech.
ChEMBL_941020 (CHEMBL2330781)
IC50
60±n/a nM
Citation
 Carvalho, JFLouvel, JDoornbos, MLKlaasse, EYu, ZBrussee, JIJzerman, AP Strategies to reduce HERG K+ channel blockade. Exploring heteroaromaticity and rigidity in novel pyridine analogues of dofetilide. J Med Chem 56:2828-40 (2013)  
Target
Name:
Potassium voltage-gated channel subfamily H member 2
Synonyms:
1,3-beta-glucan synthase component GLS2 ERG Eag-related protein 1 Ether-a-go-go-related gene (HERG) Ether-a-go-go-related gene potassium channel 1 Ether-a-go-go-related gene potassium channel 1 (hERG1) Ether-a-go-go-related protein 1 H-ERG KCNH2 Potassium voltage-gated channel subfamily H member 2 (hERG) Voltage-gated potassium channel subunit Kv11.1 hERG Potassium Channel 1 | putative potassium channel subunit
Type:
Multi-pass membrane protein
Mol. Mass.:
126672.65
Organism:
Homo sapiens (Human)
Description:
Q12809
Residue:
1159
  
Inhibitor
Name:
BDBM50427959
Synonyms:
CHEMBL2324245
Type:
Small organic molecule
Emp. Form.:
C24H26Cl2NO2
Mol. Mass.:
431.374
SMILES:
C[n+]1c(CCCOc2cccc(Cl)c2)cccc1CCCOc1cccc(Cl)c1
: