Target
Poly [ADP-ribose] polymerase tankyrase-2
Ligand
BDBM50427991
Substrate
Meas. Tech.
ChEMBL_941156 (CHEMBL2330982)
IC50
12300±n/a nM
Citation
 Voronkov, AHolsworth, DDWaaler, JWilson, SREkblad, BPerdreau-Dahl, HDinh, HDrewes, GHopf, CMorth, JPKrauss, S Structural basis and SAR for G007-LK, a lead stage 1,2,4-triazole based specific tankyrase 1/2 inhibitor. J Med Chem 56:3012-23 (2013)  
Target
Name:
Poly [ADP-ribose] polymerase tankyrase-2
Synonyms:
(ARTD6 or PARP5b) Poly [ADP-ribose] polymerase tankyrase-2 TNKL TNKS2_HUMAN Tankyrase 2 Tankyrase-2 Tankyrase-2 (TNKS2)
Type:
Enzyme
Mol. Mass.:
126937.16
Organism:
Homo sapiens (Human)
Description:
Q9H2K2
Residue:
1166
  
Inhibitor
Name:
BDBM50427991
Synonyms:
CHEMBL2325501
Type:
Small organic molecule
Emp. Form.:
C23H14ClFN6O2
Mol. Mass.:
460.848
SMILES:
Fc1ccc(cc1)-c1nnc(C=Cc2nnc(o2)-c2cc[nH]c(=O)c2)n1-c1ccccc1Cl
: