Target
Protein-serine O-palmitoleoyltransferase porcupine
Ligand
BDBM50428022
Substrate
Meas. Tech.
ChEMBL_941167 (CHEMBL2330993)
EC50
580±n/a nM
Citation
 Wang, XMoon, JDodge, MEPan, XZhang, LHanson, JMTuladhar, RMa, ZShi, HWilliams, NSAmatruda, JFCarroll, TJLum, LChen, C The development of highly potent inhibitors for porcupine. J Med Chem 56:2700-4 (2013)  
Target
Name:
Protein-serine O-palmitoleoyltransferase porcupine
Synonyms:
PORCN_MOUSE Porcn Probable protein-cysteine N-palmitoyltransferase porcupine mPORC
Type:
PROTEIN
Mol. Mass.:
52528.36
Organism:
Mus musculus
Description:
ChEMBL_941167
Residue:
461
  
Inhibitor
Name:
BDBM50428022
Synonyms:
CHEMBL2323237
Type:
Small organic molecule
Emp. Form.:
C24H20N4O3S2
Mol. Mass.:
476.571
SMILES:
COc1ccc2nc(NC(=O)CSc3nc4CCSc4c(=O)n3-c3ccccc3)ccc2c1
: