Target
Protein-serine O-palmitoleoyltransferase porcupine
Ligand
BDBM50428025
Substrate
Meas. Tech.
ChEMBL_941167 (CHEMBL2330993)
EC50
300±n/a nM
Citation
 Wang, XMoon, JDodge, MEPan, XZhang, LHanson, JMTuladhar, RMa, ZShi, HWilliams, NSAmatruda, JFCarroll, TJLum, LChen, C The development of highly potent inhibitors for porcupine. J Med Chem 56:2700-4 (2013)  
Target
Name:
Protein-serine O-palmitoleoyltransferase porcupine
Synonyms:
PORCN_MOUSE Porcn Probable protein-cysteine N-palmitoyltransferase porcupine mPORC
Type:
PROTEIN
Mol. Mass.:
52528.36
Organism:
Mus musculus
Description:
ChEMBL_941167
Residue:
461
  
Inhibitor
Name:
BDBM50428025
Synonyms:
CHEMBL2323234
Type:
Small organic molecule
Emp. Form.:
C23H21N3O4S2
Mol. Mass.:
467.561
SMILES:
CCOC(=O)c1ccc(NC(=O)CSc2nc3CCSc3c(=O)n2-c2ccccc2)cc1
: