Target
Protein-serine O-palmitoleoyltransferase porcupine
Ligand
BDBM50428033
Substrate
Meas. Tech.
ChEMBL_941167 (CHEMBL2330993)
EC50
30±n/a nM
Citation
 Wang, XMoon, JDodge, MEPan, XZhang, LHanson, JMTuladhar, RMa, ZShi, HWilliams, NSAmatruda, JFCarroll, TJLum, LChen, C The development of highly potent inhibitors for porcupine. J Med Chem 56:2700-4 (2013)  
Target
Name:
Protein-serine O-palmitoleoyltransferase porcupine
Synonyms:
PORCN_MOUSE Porcn Probable protein-cysteine N-palmitoyltransferase porcupine mPORC
Type:
PROTEIN
Mol. Mass.:
52528.36
Organism:
Mus musculus
Description:
ChEMBL_941167
Residue:
461
  
Inhibitor
Name:
BDBM50428033
Synonyms:
CHEMBL2325505
Type:
Small organic molecule
Emp. Form.:
C23H17F3N4O3S3
Mol. Mass.:
550.596
SMILES:
COc1ccccc1-n1c(SCC(=O)Nc2nc3ccc(cc3s2)C(F)(F)F)nc2CCSc2c1=O
: