Target
Protein-serine O-palmitoleoyltransferase porcupine
Ligand
BDBM50428040
Substrate
Meas. Tech.
ChEMBL_941167 (CHEMBL2330993)
EC50
175±n/a nM
Citation
 Wang, XMoon, JDodge, MEPan, XZhang, LHanson, JMTuladhar, RMa, ZShi, HWilliams, NSAmatruda, JFCarroll, TJLum, LChen, C The development of highly potent inhibitors for porcupine. J Med Chem 56:2700-4 (2013)  
Target
Name:
Protein-serine O-palmitoleoyltransferase porcupine
Synonyms:
PORCN_MOUSE Porcn Probable protein-cysteine N-palmitoyltransferase porcupine mPORC
Type:
PROTEIN
Mol. Mass.:
52528.36
Organism:
Mus musculus
Description:
ChEMBL_941167
Residue:
461
  
Inhibitor
Name:
BDBM50428040
Synonyms:
CHEMBL2325510
Type:
Small organic molecule
Emp. Form.:
C21H14ClFN4O2S3
Mol. Mass.:
505.008
SMILES:
Fc1ccc(cc1)-n1c(SCC(=O)Nc2nc3ccc(Cl)cc3s2)nc2CCSc2c1=O
: