Target
Protein-serine O-palmitoleoyltransferase porcupine
Ligand
BDBM50428043
Substrate
Meas. Tech.
ChEMBL_941167 (CHEMBL2330993)
EC50
25±n/a nM
Citation
 Wang, XMoon, JDodge, MEPan, XZhang, LHanson, JMTuladhar, RMa, ZShi, HWilliams, NSAmatruda, JFCarroll, TJLum, LChen, C The development of highly potent inhibitors for porcupine. J Med Chem 56:2700-4 (2013)  
Target
Name:
Protein-serine O-palmitoleoyltransferase porcupine
Synonyms:
PORCN_MOUSE Porcn Probable protein-cysteine N-palmitoyltransferase porcupine mPORC
Type:
PROTEIN
Mol. Mass.:
52528.36
Organism:
Mus musculus
Description:
ChEMBL_941167
Residue:
461
  
Inhibitor
Name:
BDBM50428043
Synonyms:
CHEMBL2324274
Type:
Small organic molecule
Emp. Form.:
C24H15ClFN5O3S
Mol. Mass.:
507.924
SMILES:
Fc1ccc(cc1)-n1nc(C(=O)NCC(=O)Nc2nc3ccc(Cl)cc3s2)c2ccccc2c1=O
: