Target
Plasminogen
Ligand
BDBM50032954
Substrate
Meas. Tech.
ChEMBL_941531 (CHEMBL2330522)
IC50
800±n/a nM
Citation
 Boström, JGrant, JAFjellström, OThelin, AGustafsson, D Potent fibrinolysis inhibitor discovered by shape and electrostatic complementarity to the drug tranexamic acid. J Med Chem 56:3273-80 (2013)  
Target
Name:
Plasminogen
Synonyms:
Activation peptide PLG Plasmin Plasmin heavy chain A, short form | Plasmin light chain B
Type:
Enzyme
Mol. Mass.:
90579.18
Organism:
Homo sapiens (Human)
Description:
Residue:
810
  
Inhibitor
Name:
BDBM50032954
Synonyms:
5-(piperidin-4-yl)isoxazol-3-ol 5-Piperidin-4-yl-isoxazol-3-ol(4-PIOL) | CHEMBL311761
Type:
Small organic molecule
Emp. Form.:
C8H12N2O2
Mol. Mass.:
168.1931
SMILES:
O=c1cc(o[nH]1)C1CCNCC1
: