Target
G-protein coupled bile acid receptor 1
Ligand
BDBM50428102
Substrate
Meas. Tech.
ChEMBL_943944 (CHEMBL2339911)
EC50
146±n/a nM
Citation
 Piotrowski, DWFutatsugi, KWarmus, JSOrr, STFreeman-Cook, KDLondregan, ATWei, LJennings, SMHerr, MCoffey, SBJiao, WStorer, GHepworth, DWang, JLavergne, SYChin, JEHadcock, JRBrenner, MBWolford, ACJanssen, AMRoush, NSBuxton, JHinchey, TKalgutkar, ASSharma, RFlynn, DA Identification of Tetrahydropyrido[4,3-d]pyrimidine Amides as a New Class of Orally Bioavailable TGR5 Agonists. ACS Med Chem Lett 4:63-8 (2013)  
Target
Name:
G-protein coupled bile acid receptor 1
Synonyms:
BG37 GPBAR_HUMAN TGR5 hGPCR19
Type:
G Protein-Coupled Receptor (GPCR)
Mol. Mass.:
35260.02
Organism:
Homo sapiens (Human)
Description:
CHO cells transiently transfected with hTGR5.
Residue:
330
  
Inhibitor
Name:
BDBM50428102
Synonyms:
CHEMBL2331651
Type:
Small organic molecule
Emp. Form.:
C21H25F2N5O2
Mol. Mass.:
417.4523
SMILES:
CCNc1nc2CCN(Cc2c(n1)C(N)=O)C(=O)CCc1ccc(cc1)C(C)(F)F
: