Target
Phosphatidylinositol 4,5-bisphosphate 3-kinase catalytic subunit alpha isoform
Ligand
BDBM50428113
Substrate
Meas. Tech.
ChEMBL_944957 (CHEMBL2343996)
Ki
0.532000±n/a nM
Citation
 Cheng, HLi, CBailey, SBaxi, SMGoulet, LGuo, LHoffman, JJiang, YJohnson, TOJohnson, TWKnighton, DRLi, JLiu, KKLiu, ZMarx, MAWalls, MWells, PAYin, MJZhu, JZientek, M Discovery of the Highly Potent PI3K/mTOR Dual Inhibitor PF-04979064 through Structure-Based Drug Design. ACS Med Chem Lett 4:91-7 (2013)  
Target
Name:
Phosphatidylinositol 4,5-bisphosphate 3-kinase catalytic subunit alpha isoform
Synonyms:
PI3-kinase p110 subunit alpha PI3K Phosphatidylinositol 3-kinase p110α (p110α) Phosphatidylinositol-4,5-bisphosphate 3-kinase catalytic subunit alpha isoform PtdIns-3-kinase p110
Type:
Protein
Mol. Mass.:
124421.84
Organism:
Mus musculus (Mouse)
Description:
P42337
Residue:
1068
  
Inhibitor
Name:
BDBM50428113
Synonyms:
CHEMBL2331663 | US8791131, 172
Type:
Small organic molecule
Emp. Form.:
C23H24N6O3
Mol. Mass.:
432.4751
SMILES:
Cc1ccc(cn1)-c1ccc2ncc3n(C)c(=O)n(C4CCN(CC4)C(=O)CO)c3c2n1
: