Target
Phosphatidylinositol 4,5-bisphosphate 3-kinase catalytic subunit alpha isoform
Ligand
BDBM50428114
Substrate
Meas. Tech.
ChEMBL_944957 (CHEMBL2343996)
Ki
2.0±n/a nM
Citation
 Cheng, HLi, CBailey, SBaxi, SMGoulet, LGuo, LHoffman, JJiang, YJohnson, TOJohnson, TWKnighton, DRLi, JLiu, KKLiu, ZMarx, MAWalls, MWells, PAYin, MJZhu, JZientek, M Discovery of the Highly Potent PI3K/mTOR Dual Inhibitor PF-04979064 through Structure-Based Drug Design. ACS Med Chem Lett 4:91-7 (2013)  
Target
Name:
Phosphatidylinositol 4,5-bisphosphate 3-kinase catalytic subunit alpha isoform
Synonyms:
PI3-kinase p110 subunit alpha PI3K Phosphatidylinositol 3-kinase p110α (p110α) Phosphatidylinositol-4,5-bisphosphate 3-kinase catalytic subunit alpha isoform PtdIns-3-kinase p110
Type:
Protein
Mol. Mass.:
124421.84
Organism:
Mus musculus (Mouse)
Description:
P42337
Residue:
1068
  
Inhibitor
Name:
BDBM50428114
Synonyms:
CHEMBL2331662 | US8791131, 173
Type:
Small organic molecule
Emp. Form.:
C23H24N6O2
Mol. Mass.:
416.4757
SMILES:
CC(=O)N1CCC(CC1)n1c2c(cnc3ccc(nc23)-c2ccc(C)nc2)n(C)c1=O
: