Target
Farnesyl pyrophosphate synthase
Ligand
BDBM50428292
Substrate
Meas. Tech.
ChEMBL_947371 (CHEMBL2344604)
IC50
30±n/a nM
Citation
 Zhang, YZhu, WLiu, YLWang, HWang, KLi, KNo, JHAyong, LGulati, APang, RFreitas-Junior, LMorita, CTOld-Field, E Chemo-Immunotherapeutic Anti-Malarials Targeting Isoprenoid Biosynthesis. ACS Med Chem Lett 4:423-427 (2013)  
Target
Name:
Farnesyl pyrophosphate synthase
Synonyms:
Dimethylallyltranstransferase FPP synthase FPPS_HUMAN Farnesyl diphosphate synthase Farnesyl diphosphate synthetase Farnesyl pyrophosphate synthetase KIAA1293 | P14324
Type:
Enzyme
Mol. Mass.:
48272.89
Organism:
Homo sapiens (Human)
Description:
P14324
Residue:
419
  
Inhibitor
Name:
BDBM50428292
Synonyms:
CHEMBL2338356
Type:
Small organic molecule
Emp. Form.:
C9H18N2O7P2
Mol. Mass.:
328.1959
SMILES:
CCCCn1cc[n+](CC(O)(P(O)(O)=O)P(O)([O-])=O)c1
: