Target
Broad substrate specificity ATP-binding cassette transporter ABCG2
Ligand
BDBM50206310
Substrate
Meas. Tech.
ChEMBL_947405 (CHEMBL2345054)
IC50
127±n/a nM
Citation
 Ochoa-Puentes, CBauer, SKühnle, MBernhardt, GBuschauer, AKönig, B Benzanilide-Biphenyl Replacement: A Bioisosteric Approach to Quinoline Carboxamide-Type ABCG2 Modulators. ACS Med Chem Lett 4:393-6 (2013)  
Target
Name:
Broad substrate specificity ATP-binding cassette transporter ABCG2
Synonyms:
ABCG2 ABCP ATP-binding cassette sub-family G member 2 ATP-binding cassette, sub-family G, member 2 BCRP1 CDw338 Mitoxantrone resistance-associated protein Urate exporter
Type:
Multi-pass membrane protein; monomer or homodimer; disulfide-linked
Mol. Mass.:
72329.48
Organism:
Homo sapiens (Human)
Description:
Q9UNQ0
Residue:
655
  
Inhibitor
Name:
BDBM50206310
Synonyms:
5-Methoxy-9-oxo-9,10-dihydro-acridine-4-carboxylic acid {4-[2-(6,7-dimethoxy-3,4-dihydro-1H-isoquinolin-2-yl)-ethyl]-phenyl}-amide ELACRIDAR HYDROCHLORIDE N-(4-(2-(6,7-dimethoxy-3,4-dihydroisoquinolin-2(1H)-yl)ethyl)phenyl)-5-methoxy-9-oxo-9,10-dihydroacridine-2-carboxamide N-4-[2-(1,2,3,4-Tetrahydro-6,7-dimethoxy-2-isoquinolinyl)ethyl]phenyl}-9,10-dihydro-5-methoxy-9-oxo-4-acridone carboxamide | US11739089, Compound Elacridar
Type:
Small organic molecule
Emp. Form.:
C34H33N3O5
Mol. Mass.:
563.6429
SMILES:
COc1cc2CCN(CCc3ccc(NC(=O)c4cccc5c4[nH]c4c(OC)cccc4c5=O)cc3)Cc2cc1OC
: