Target
Carbonic anhydrase 2
Ligand
BDBM92712
Substrate
Meas. Tech.
ChEMBL_942105 (CHEMBL2340803)
Ki
5200±n/a nM
Citation
 Carta, FVullo, DMaresca, AScozzafava, ASupuran, CT Mono-/dihydroxybenzoic acid esters and phenol pyridinium derivatives as inhibitors of the mammalian carbonic anhydrase isoforms I, II, VII, IX, XII and XIV. Bioorg Med Chem 21:1564-9 (2013)  
Target
Name:
Carbonic anhydrase 2
Synonyms:
CA-II CAC Carbonate dehydratase II Carbonic anhydrase 2 (CA-II) Carbonic anhydrase C Carbonic anhydrase II (CA-II) Carbonic anhydrase II (hCA II) | Carbonic anhydrase isoenzyme II (hCA II)
Type:
Enzyme
Mol. Mass.:
29250.71
Organism:
Homo sapiens (Human)
Description:
P00918
Residue:
260
  
Inhibitor
Name:
BDBM92712
Synonyms:
2,6-Dihydroxybenzoate, VII
Type:
Small molecule
Emp. Form.:
C7H6O4
Mol. Mass.:
154.1201
SMILES:
OC(=O)c1c(O)cccc1O
: