Target
Carbonic anhydrase 1
Ligand
BDBM50428426
Substrate
Meas. Tech.
ChEMBL_942131 (CHEMBL2341287)
Ki
44100±n/a nM
Citation
 Davis, RAVullo, DMaresca, ASupuran, CTPoulsen, SA Natural product coumarins that inhibit human carbonic anhydrases. Bioorg Med Chem 21:1539-43 (2013)  
Target
Name:
Carbonic anhydrase 1
Synonyms:
CA-I CAB Carbonate dehydratase I Carbonic anhydrase 1 (CA I) Carbonic anhydrase 1 (Recombinant CA I) Carbonic anhydrase B Carbonic anhydrase I (CA I) Carbonic anhydrase I (CAI) Carbonic anhydrase isoenzyme I (hCA I) | hCA
Type:
Enzyme
Mol. Mass.:
28873.37
Organism:
Homo sapiens (Human)
Description:
P00915
Residue:
261
  
Inhibitor
Name:
BDBM50428426
Synonyms:
CHEMBL2334354
Type:
Small organic molecule
Emp. Form.:
C17H12O8
Mol. Mass.:
344.2724
SMILES:
COc1cc2c3c(oc(=O)c4cc(OC)c(OC)c(oc2=O)c34)c1O
: