Target
Carbonic anhydrase
Ligand
BDBM50428443
Substrate
Meas. Tech.
ChEMBL_942138 (CHEMBL2341294)
Ki
0.500000±n/a nM
Citation
 Syrjänen, LTolvanen, MEHilvo, MVullo, DCarta, FSupuran, CTParkkila, S Characterization, bioinformatic analysis and dithiocarbamate inhibition studies of two newa-carbonic anhydrases, CAH1 and CAH2, from the fruit fly Drosophila melanogaster. Bioorg Med Chem 21:1516-21 (2013)  
Target
Name:
Carbonic anhydrase
Synonyms:
CAH1 Dmel_CG7820 | GH09688p
Type:
PROTEIN
Mol. Mass.:
29950.70
Organism:
Drosophila melanogaster
Description:
ChEMBL_942138
Residue:
270
  
Inhibitor
Name:
BDBM50428443
Synonyms:
CHEMBL2334360
Type:
Small organic molecule
Emp. Form.:
C5H4NS3
Mol. Mass.:
174.288
SMILES:
[S-]C(=S)Nc1cccs1
: