Target
Carbonic anhydrase 9
Ligand
BDBM26187
Substrate
Meas. Tech.
ChEMBL_942142 (CHEMBL2341298)
Ki
8800±n/a nM
Citation
 Riafrecha, LERodríguez, OMVullo, DSupuran, CTColinas, PA Synthesis of C-cinnamoyl glycosides and their inhibitory activity against mammalian carbonic anhydrases. Bioorg Med Chem 21:1489-94 (2013)  
Target
Name:
Carbonic anhydrase 9
Synonyms:
CA-IX CAH9_HUMAN Carbonic anhydrase 9 (CA IX) Carbonic anhydrase 9 precursor Carbonic anhydrase IX (CAIX) Carbonic anhydrases; II & IX MN RCC-associated antigen G250
Type:
Enzyme
Mol. Mass.:
49669.03
Organism:
Homo sapiens (Human)
Description:
Catalytic domain of human cloned isozyme was used in the assay
Residue:
459
  
Inhibitor
Name:
BDBM26187
Synonyms:
α-CA inhibitor, 11 US9688816, 2 | phenol
Type:
Small organic molecule
Emp. Form.:
C6H6O
Mol. Mass.:
94.1112
SMILES:
Oc1ccccc1
: