Target
Carbonic anhydrase 12
Ligand
BDBM50428445
Substrate
Meas. Tech.
ChEMBL_942151 (CHEMBL2341307)
Ki
3140±n/a nM
Citation
 Tuccinardi, TBertini, SGranchi, COrtore, GMacchia, MMinutolo, FMartinelli, ASupuran, CT Salicylaldoxime derivatives as new leads for the development of carbonic anhydrase inhibitors. Bioorg Med Chem 21:1511-5 (2013)  
Target
Name:
Carbonic anhydrase 12
Synonyms:
CA-XII CAH12_HUMAN Carbonic anhydrase Carbonic anhydrase XII Carbonic anhydrase XII (CAXII) | Tumor antigen HOM-RCC-3.1.3
Type:
Enzyme
Mol. Mass.:
39456.00
Organism:
Homo sapiens (Human)
Description:
Catalytic domain of human cloned isozyme was used in the assay
Residue:
354
  
Inhibitor
Name:
BDBM50428445
Synonyms:
CHEMBL272457
Type:
Small organic molecule
Emp. Form.:
C14H10N2O3
Mol. Mass.:
254.2408
SMILES:
Oc1ccc(cc1)-c1ccc(CN=O)c(O)c1C#N
: