Target
Carbonic anhydrase 12
Ligand
BDBM50428450
Substrate
Meas. Tech.
ChEMBL_942151 (CHEMBL2341307)
Ki
4240±n/a nM
Citation
 Tuccinardi, TBertini, SGranchi, COrtore, GMacchia, MMinutolo, FMartinelli, ASupuran, CT Salicylaldoxime derivatives as new leads for the development of carbonic anhydrase inhibitors. Bioorg Med Chem 21:1511-5 (2013)  
Target
Name:
Carbonic anhydrase 12
Synonyms:
CA-XII CAH12_HUMAN Carbonic anhydrase Carbonic anhydrase XII Carbonic anhydrase XII (CAXII) | Tumor antigen HOM-RCC-3.1.3
Type:
Enzyme
Mol. Mass.:
39456.00
Organism:
Homo sapiens (Human)
Description:
Catalytic domain of human cloned isozyme was used in the assay
Residue:
354
  
Inhibitor
Name:
BDBM50428450
Synonyms:
CHEMBL475278
Type:
Small organic molecule
Emp. Form.:
C13H10FNO3
Mol. Mass.:
247.2218
SMILES:
Oc1ccc(cc1F)-c1ccc(O)c(CN=O)c1
: